**
** Heading +++++++++++++++++++++++++++++++++++++++++++++++++
**
*Heading
Hash: Uxxj6hP0, Date: 06/04/2022, Unit system: MM_TON_S_C
**
** Nodes +++++++++++++++++++++++++++++++++++++++++++++++++++
**
*Node
**
** Elements ++++++++++++++++++++++++++++++++++++++++++++++++
**
*Element, Type=C3D10, Elset=Solid_part-1
**
** Node sets +++++++++++++++++++++++++++++++++++++++++++++++
**
*Nset, Nset=Internal_Selection-1_Fixed-1
*Nset, Nset=Internal-1_Internal_Selection-1_Surface_traction-1
**
** Element sets ++++++++++++++++++++++++++++++++++++++++++++
**
*Elset, Elset=Internal_Selection-1_Solid_section-1
Solid_part-1
*Elset, Elset=Internal-1_Internal_Selection-1_Surface_traction-1_S4
*Elset, Elset=Internal-1_Internal_Selection-1_Surface_traction-1_S2
*Elset, Elset=Internal-1_Internal_Selection-1_Surface_traction-1_S3
*Elset, Elset=Internal-1_Internal_Selection-1_Surface_traction-1_S1
**
** Surfaces ++++++++++++++++++++++++++++++++++++++++++++++++
**
*Surface, Name=Internal_Selection-1_Surface_traction-1, Type=Element
Internal-1_Internal_Selection-1_Surface_traction-1_S4, S4
Internal-1_Internal_Selection-1_Surface_traction-1_S2, S2
Internal-1_Internal_Selection-1_Surface_traction-1_S3, S3
Internal-1_Internal_Selection-1_Surface_traction-1_S1, S1
**
** Physical constants ++++++++++++++++++++++++++++++++++++++
**
**
** Materials +++++++++++++++++++++++++++++++++++++++++++++++
**
*Material, Name=Steel
*Elastic
210000, 0.3
*Density
7.85E-09
**
** Sections ++++++++++++++++++++++++++++++++++++++++++++++++
**
*Solid section, Elset=Internal_Selection-1_Solid_section-1, Material=Steel
**
** Pre-tension sections ++++++++++++++++++++++++++++++++++++
**
**
** Constraints +++++++++++++++++++++++++++++++++++++++++++++
**
**
** Surface interactions ++++++++++++++++++++++++++++++++++++
**
**
** Contact pairs +++++++++++++++++++++++++++++++++++++++++++
**
**
** Amplitudes ++++++++++++++++++++++++++++++++++++++++++++++
**
*Amplitude, Name=Tabular-1
0, 1, 0.05, 1.309016994, 0.1, 1.587785252, 0.15, 1.809016994,
0.2, 1.951056516, 0.25, 2, 0.3, 1.951056516, 0.35, 1.809016994,
0.4, 1.587785252, 0.45, 1.309016994, 0.5, 1, 0.55, 0.690983006,
0.6, 0.412214748, 0.65, 0.190983006, 0.7, 0.048943484, 0.75, 0,
0.8, 0.048943484, 0.85, 0.190983006, 0.9, 0.412214748, 0.95, 0.690983006,
1, 1
**
** Initial conditions ++++++++++++++++++++++++++++++++++++++
**
**
** Steps +++++++++++++++++++++++++++++++++++++++++++++++++++
**
**
** Step-1 ++++++++++++++++++++++++++++++++++++++++++++++++++
**
*Step, Inc=100
*Static, Direct
0.1, 1
**
** Boundary conditions +++++++++++++++++++++++++++++++++++++
**
*Boundary, op=New
** Name: Fixed-1
*Boundary
Internal_Selection-1_Fixed-1, 1, 6, 0
**
** Loads +++++++++++++++++++++++++++++++++++++++++++++++++++
**
*Cload, op=New
*Dload, op=New
** Name: Surface_traction-1
*Cload, Amplitude=Tabular-1
6097, 2, -3.07008281E-002
8518, 2, -6.10954571E-002
8517, 2, -5.79629948E-002
8479, 2, -8.99673201E-002
8480, 2, -8.37891139E-002
8482, 2, -8.96475306E-002
8586, 2, -6.98800511E-002
8585, 2, -5.88919798E-002
**
** Defined fields ++++++++++++++++++++++++++++++++++++++++++
**
**
** History outputs +++++++++++++++++++++++++++++++++++++++++
**
**
** Field outputs +++++++++++++++++++++++++++++++++++++++++++
**
*Node file
RF, U
*El file
S, E
**
** End step ++++++++++++++++++++++++++++++++++++++++++++++++
**
*End step