**
** Heading +++++++++++++++++++++++++++++++++++++++++++++++++
**
*Heading
Hash: bUzCyKbo, Date: 04/11/2022, Unit system: MM_TON_S_C
**
** Nodes +++++++++++++++++++++++++++++++++++++++++++++++++++
**
*Node
**
** Elements ++++++++++++++++++++++++++++++++++++++++++++++++
**
*Element, Type=S8R, Elset=composite_shell
**
** Node sets +++++++++++++++++++++++++++++++++++++++++++++++
**
*Nset, Nset=Internal_Selection-1_Fixed-1
*Nset, Nset=Internal_Selection-1_Conc-1
*Nset, Nset=Internal-1_Internal_Selection-1_ShellEdge-1
**
** Element sets ++++++++++++++++++++++++++++++++++++++++++++
**
*Elset, Elset=Ele_all
*Elset, Elset=Internal-1_Internal_Selection-1_ShellEdge-1_S6
*Elset, Elset=Internal-1_Internal_Selection-1_ShellEdge-1_S4
**
** Surfaces ++++++++++++++++++++++++++++++++++++++++++++++++
**
*Surface, Name=Internal_Selection-1_ShellEdge-1, Type=Element
Internal-1_Internal_Selection-1_ShellEdge-1_S6, S6
Internal-1_Internal_Selection-1_ShellEdge-1_S4, S4
**
** Physical constants ++++++++++++++++++++++++++++++++++++++
**
**
** Materials +++++++++++++++++++++++++++++++++++++++++++++++
**
*Material, Name=AS4PEEK0
*Density
7.8E-09
*Elastic, Type=ENGINEERING CONSTANTS
133860.0, 7706.0, 7706.0, 0.301,0.301, 0.396, 4306.0, 4306.0,
2760.0, 294.0
*Expansion, Zero=20
1.1E-05
*Conductivity
14
*Specific heat
440000000
*ORIENTATION, NAME=ORI_0,SYSTEM=RECTANGULAR
*ORIENTATION, NAME=ORI_45,SYSTEM=RECTANGULAR
*ORIENTATION, NAME=ORI_-45,SYSTEM=RECTANGULAR
*ORIENTATION, NAME=ORI_90,SYSTEM=RECTANGULAR
**
** Sections ++++++++++++++++++++++++++++++++++++++++++++++++
**
*Shell section, Elset=Ele_all, COMPOSITE
0.25, ,AS4PEEK0,ORI_0
0.25, ,AS4PEEK0,ORI_45
0.25, ,AS4PEEK0,ORI_-45
0.25, ,AS4PEEK0,ORI_90
**
** Pre-tension sections ++++++++++++++++++++++++++++++++++++
**
**
** Constraints +++++++++++++++++++++++++++++++++++++++++++++
**
**
** Surface interactions ++++++++++++++++++++++++++++++++++++
**
**
** Contact pairs +++++++++++++++++++++++++++++++++++++++++++
**
**
** Initial conditions ++++++++++++++++++++++++++++++++++++++
**
**
** Steps +++++++++++++++++++++++++++++++++++++++++++++++++++
**
**
** Step-1 ++++++++++++++++++++++++++++++++++++++++++++++++++
**
*Step
*Static
**
** Boundary conditions +++++++++++++++++++++++++++++++++++++
**
*Boundary, op=New
** Name: Fixed-1
*Boundary
Internal_Selection-1_Fixed-1, 1, 6, 0
**
** Loads +++++++++++++++++++++++++++++++++++++++++++++++++++
**
*Cload, op=New
*Dload, op=New
** Name: Conc-1
*Cload
Internal_Selection-1_Conc-1, 3, 10
** Name: ShellEdge-1: Deactivated
**
** Defined fields ++++++++++++++++++++++++++++++++++++++++++
**
**
** History outputs +++++++++++++++++++++++++++++++++++++++++
**
**
** Field outputs +++++++++++++++++++++++++++++++++++++++++++
**
*Node file
RF, U
*El file
S, E
**
** End step ++++++++++++++++++++++++++++++++++++++++++++++++
**
*End step