**
**
*HEADING
**
**
**
*NODE
**
** SOLID ELEMENTS
**
*ELEMENT, TYPE=C3D8, ELSET=P4;Default PSOLID Property
**
**
**
** SECTION DATA
**
*SOLID SECTION, ELSET=P4;Default PSOLID Property, MATERIAL=M4;Default MATERIAL
**
** MATERIALS
**
*MATERIAL, NAME=M4;Default MATERIAL
*DENSITY
                 7.85E-9,
*ELASTIC, TYPE=ISOTROPIC
                 210000.,                      0.3
**
**
**
** SURFACE DEFINITIONS
**
*SURFACE, NAME=S2;SET_FACETS_0000000002, TYPE=ELEMENT
**ANSA_SURFACE_NAME;S2\;SET_FACETS_0000000002;
     211, S3
     224, S3
     407, S3
     420, S3
     509, S3
     528, S3
     603, S3
     616, S3
     197, S4
     199, S4
     202, S4
     393, S4
     395, S4
     398, S4
     489, S4
     493, S4
     496, S4
     589, S4
     591, S4
     594, S4
** ... 8 like lines cut
**
** SETS
**
**ANSA_ID;1;
*NSET, NSET=SET_FACETS_0000000001
**
** BOUNDARY
**
*BOUNDARY, TYPE=DISPLACEMENT
**ANSA_ID;1;
SET_FACETS_0000000001,        1,        6,                       0.
**
** STEPS
**
**ANSA_ID;1;
**
** STEP 1
**
*STEP, NAME=Anonymous STEP 1
*STATIC
**
** DLOAD       (Membrane, Shell, Continuum)
**
*DLOAD
     528, P3,                       1.
     517, P5,                       1.
     509, P3,                       1.
     502, P5,                       1.
     496, P4,                       1.
     493, P4,                       1.
     489, P4,                       1.
     616, P3,                       1.
     609, P5,                       1.
     603, P3,                       1.
     598, P5,                       1.
     594, P4,                       1.
     591, P4,                       1.
     589, P4,                       1.
     420, P3,                       1.
     413, P5,                       1.
     407, P3,                       1.
     402, P5,                       1.
     398, P4,                       1.
     395, P4,                       1.
** ... 8 like lines cut
*END STEP